{"text_format":"1","workbook":"xlsx","n_sheets":3,"sheets":["ExplodedBOM","FlatBOM","PartSpecs"],"not_rendered":{"charts":0,"images":0,"macros":1,"external_links":0,"defined_names":0,"comments":1,"pivot_tables":1},"unopened":[],"bounds":{"document_bytes":16777216,"sheet_cells":100000,"rows_first":2000,"rows_last":500,"rows_between":2000,"halvings":0,"cell_chars":16384,"cell_head_chars":4096},"cells_cut":0,"cells_raw":0,"read":"whole","date_system":"1900"}

{"sheet":"ExplodedBOM","index":0,"n_rows":189,"n_cols":10,"rows_kept":189,"cut":false,"hidden":false,"merged":[]}
["QtyScalar","ParentLine",".","BOM Level","Part","Qty","UOM","Qty_Exploded","Vendor","Phantom"]
[{"$f":"F2","v":1},1,null,0,"(SUPERBOM)",1,"ea",{"$f":"F2*A2","v":1},null,{"$f":"IF(MID(ExplodedBOM!$E2,1,1)=\"(\",TRUE,FALSE)","v":true}]
[{"$f":"IF(MID(E2,1,1)=\"(\",F2*A2,\n      IF(D3<D2,INDIRECT(\"A\" & B3+1),A2)\n)","v":1},{"$f":"SUMPRODUCT(MAX(ROW($2:3)*($D$2:D3=(D3-1))))","v":2},null,1,"(post)",3,"ea",{"$f":"F3*A3","v":3},null,{"$f":"IF(MID(ExplodedBOM!$E3,1,1)=\"(\",TRUE,FALSE)","v":true}]
[3,{"$f":"SUMPRODUCT(MAX(ROW($2:4)*($D$2:D4=(D4-1))))","v":3},null,2,"2020-800mm",1,"ea",3,null,{"$f":"IF(MID(ExplodedBOM!$E4,1,1)=\"(\",TRUE,FALSE)","v":false}]
[3,{"$f":"SUMPRODUCT(MAX(ROW($2:5)*($D$2:D5=(D5-1))))","v":3},null,2,"open_rail-700mm",1,"ea",3,null,{"$f":"IF(MID(ExplodedBOM!$E5,1,1)=\"(\",TRUE,FALSE)","v":false}]
[3,{"$f":"SUMPRODUCT(MAX(ROW($2:6)*($D$2:D6=(D6-1))))","v":3},null,2,"scrw_m5_10 (open_rail_kit_excess)",15,"ea",45,null,{"$f":"IF(MID(ExplodedBOM!$E6,1,1)=\"(\",TRUE,FALSE)","v":false}]
[3,{"$f":"SUMPRODUCT(MAX(ROW($2:7)*($D$2:D7=(D7-1))))","v":3},null,2,"nut_extr_m5 (open_rail_kit_excess)",15,"ea",45,null,{"$f":"IF(MID(ExplodedBOM!$E7,1,1)=\"(\",TRUE,FALSE)","v":false}]
[3,{"$f":"SUMPRODUCT(MAX(ROW($2:8)*($D$2:D8=(D8-1))))","v":3},null,2,"rp_base_vertex",1,"ea",3,null,{"$f":"IF(MID(ExplodedBOM!$E8,1,1)=\"(\",TRUE,FALSE)","v":false}]
[3,{"$f":"SUMPRODUCT(MAX(ROW($2:9)*($D$2:D9=(D9-1))))","v":3},null,2,"motor_nema_17",1,"ea",3,null,{"$f":"IF(MID(ExplodedBOM!$E9,1,1)=\"(\",TRUE,FALSE)","v":false}]
[3,{"$f":"SUMPRODUCT(MAX(ROW($2:10)*($D$2:D10=(D10-1))))","v":3},null,2,"belt_gt2_1700mm",1,"ea",3,null,{"$f":"IF(MID(ExplodedBOM!$E10,1,1)=\"(\",TRUE,FALSE)","v":false}]
[3,{"$f":"SUMPRODUCT(MAX(ROW($2:11)*($D$2:D11=(D11-1))))","v":3},null,2,"gear_drive_belt_gt2",1,"ea",3,null,{"$f":"IF(MID(ExplodedBOM!$E11,1,1)=\"(\",TRUE,FALSE)","v":false}]
[3,{"$f":"SUMPRODUCT(MAX(ROW($2:12)*($D$2:D12=(D12-1))))","v":3},null,2,"scrw_m3_set",1,"ea",3,null,{"$f":"IF(MID(ExplodedBOM!$E12,1,1)=\"(\",TRUE,FALSE)","v":false}]
[3,{"$f":"SUMPRODUCT(MAX(ROW($2:13)*($D$2:D13=(D13-1))))","v":3},null,2,"2020-300mm",2,"ea",6,null,{"$f":"IF(MID(ExplodedBOM!$E13,1,1)=\"(\",TRUE,FALSE)","v":false}]
[3,{"$f":"SUMPRODUCT(MAX(ROW($2:14)*($D$2:D14=(D14-1))))","v":3},null,2,"scrw_m4_10",8,"ea",24,null,{"$f":"IF(MID(ExplodedBOM!$E14,1,1)=\"(\",TRUE,FALSE)","v":false}]
[3,{"$f":"SUMPRODUCT(MAX(ROW($2:15)*($D$2:D15=(D15-1))))","v":3},null,2,"wshr_m4",10,"ea",30,null,{"$f":"IF(MID(ExplodedBOM!$E15,1,1)=\"(\",TRUE,FALSE)","v":false}]
[3,{"$f":"SUMPRODUCT(MAX(ROW($2:16)*($D$2:D16=(D16-1))))","v":3},null,2,"nut_extr_m4",10,"ea",30,null,{"$f":"IF(MID(ExplodedBOM!$E16,1,1)=\"(\",TRUE,FALSE)","v":false}]
[3,{"$f":"SUMPRODUCT(MAX(ROW($2:17)*($D$2:D17=(D17-1))))","v":3},null,2,"scrw_m3_12",4,"ea",12,null,{"$f":"IF(MID(ExplodedBOM!$E17,1,1)=\"(\",TRUE,FALSE)","v":false}]
[3,{"$f":"SUMPRODUCT(MAX(ROW($2:18)*($D$2:D18=(D18-1))))","v":3},null,2,"wshr_m3",4,"ea",12,null,{"$f":"IF(MID(ExplodedBOM!$E18,1,1)=\"(\",TRUE,FALSE)","v":false}]
[3,{"$f":"SUMPRODUCT(MAX(ROW($2:19)*($D$2:D19=(D19-1))))","v":3},null,2,"scrw_m4_12",2,"ea",6,null,{"$f":"IF(MID(ExplodedBOM!$E19,1,1)=\"(\",TRUE,FALSE)","v":false}]
[3,{"$f":"SUMPRODUCT(MAX(ROW($2:20)*($D$2:D20=(D20-1))))","v":3},null,2,"(carriage)",1,"ea",3,null,{"$f":"IF(MID(ExplodedBOM!$E20,1,1)=\"(\",TRUE,FALSE)","v":true}]
[3,{"$f":"SUMPRODUCT(MAX(ROW($2:21)*($D$2:D21=(D21-1))))","v":20},null,3,"rp_plate_slider",1,"ea",3,null,{"$f":"IF(MID(ExplodedBOM!$E21,1,1)=\"(\",TRUE,FALSE)","v":false}]
[3,{"$f":"SUMPRODUCT(MAX(ROW($2:22)*($D$2:D22=(D22-1))))","v":20},null,3,"open_rail_shim",2,"ea",6,null,{"$f":"IF(MID(ExplodedBOM!$E22,1,1)=\"(\",TRUE,FALSE)","v":false}]
[3,{"$f":"SUMPRODUCT(MAX(ROW($2:23)*($D$2:D23=(D23-1))))","v":20},null,3,"open_rail_wheel_delrin",2,"ea",6,null,{"$f":"IF(MID(ExplodedBOM!$E23,1,1)=\"(\",TRUE,FALSE)","v":false}]
[3,{"$f":"SUMPRODUCT(MAX(ROW($2:24)*($D$2:D24=(D24-1))))","v":20},null,3,"open_rail_wheel_sst",2,"ea",6,null,{"$f":"IF(MID(ExplodedBOM!$E24,1,1)=\"(\",TRUE,FALSE)","v":false}]
[3,{"$f":"SUMPRODUCT(MAX(ROW($2:25)*($D$2:D25=(D25-1))))","v":20},null,3,"open_rail_bearing",8,"ea",24,null,{"$f":"IF(MID(ExplodedBOM!$E25,1,1)=\"(\",TRUE,FALSE)","v":false}]
[3,{"$f":"SUMPRODUCT(MAX(ROW($2:26)*($D$2:D26=(D26-1))))","v":20},null,3,"open_rail_spacer_bearing",4,"ea",12,null,{"$f":"IF(MID(ExplodedBOM!$E26,1,1)=\"(\",TRUE,FALSE)","v":false}]
[3,{"$f":"SUMPRODUCT(MAX(ROW($2:27)*($D$2:D27=(D27-1))))","v":20},null,3,"open_rail_shim_eccentric",2,"ea",6,null,{"$f":"IF(MID(ExplodedBOM!$E27,1,1)=\"(\",TRUE,FALSE)","v":false}]
[3,{"$f":"SUMPRODUCT(MAX(ROW($2:28)*($D$2:D28=(D28-1))))","v":20},null,3,"open_rail_scrw_m5_std_wheel_mnt",4,"ea",12,null,{"$f":"IF(MID(ExplodedBOM!$E28,1,1)=\"(\",TRUE,FALSE)","v":false}]
[3,{"$f":"SUMPRODUCT(MAX(ROW($2:29)*($D$2:D29=(D29-1))))","v":20},null,3,"open_rail_nut_m5",4,"ea",12,null,{"$f":"IF(MID(ExplodedBOM!$E29,1,1)=\"(\",TRUE,FALSE)","v":false}]
[3,{"$f":"SUMPRODUCT(MAX(ROW($2:30)*($D$2:D30=(D30-1))))","v":20},null,3,"rp_flag_carriage",1,"ea",3,null,{"$f":"IF(MID(ExplodedBOM!$E30,1,1)=\"(\",TRUE,FALSE)","v":false}]
{"$rows_left_out":160}
{"sheet":"FlatBOM","index":1,"n_rows":101,"n_cols":7,"rows_kept":101,"cut":false,"hidden":false,"merged":[]}
["Phantom","FALSE"]
[]
["Part","Total Qty","Vendor","MFG PN","Vendor PN","Notes","URL"]
["2020_cap",16,{"$f":"VLOOKUP(A4,PartSpecs!A:Z,2,FALSE)","v":"Misumi"},{"$f":"VLOOKUP(A4,PartSpecs!A:Z,3,FALSE)","v":"HFC5-2020"},{"$f":"VLOOKUP(A4,PartSpecs!A:Z,4,FALSE)","v":"HFC5-2020"},{"$f":"VLOOKUP(A4,PartSpecs!A:Z,5,FALSE)","v":"Site is designed for commerical customers, but you can still setup an account.  You must manually enter the part numbers into a purchase order."},{"$f":"VLOOKUP(A4,PartSpecs!A:Z,6,FALSE)","v":"[http://us.misumi-ec.com/]"}]
["2020-134mm",1,{"$f":"VLOOKUP(A5,PartSpecs!A:Z,2,FALSE)","v":"Misumi"},{"$f":"VLOOKUP(A5,PartSpecs!A:Z,3,FALSE)","v":"HFS5-2020-134"},{"$f":"VLOOKUP(A5,PartSpecs!A:Z,4,FALSE)","v":"HFS5-2020-134"},{"$f":"VLOOKUP(A5,PartSpecs!A:Z,5,FALSE)","v":"Site is designed for commerical customers, but you can still setup an account.  You must manually enter the part numbers into a purchase order."},{"$f":"VLOOKUP(A5,PartSpecs!A:Z,6,FALSE)","v":"[http://us.misumi-ec.com/]"}]
["2020-200mm",3,{"$f":"VLOOKUP(A6,PartSpecs!A:Z,2,FALSE)","v":"Misumi"},{"$f":"VLOOKUP(A6,PartSpecs!A:Z,3,FALSE)","v":"HFS5-2020-200"},{"$f":"VLOOKUP(A6,PartSpecs!A:Z,4,FALSE)","v":"HFS5-2020-200"},{"$f":"VLOOKUP(A6,PartSpecs!A:Z,5,FALSE)","v":"Site is designed for commerical customers, but you can still setup an account.  You must manually enter the part numbers into a purchase order."},{"$f":"VLOOKUP(A6,PartSpecs!A:Z,6,FALSE)","v":"[http://us.misumi-ec.com/]"}]
["2020-300mm",7,{"$f":"VLOOKUP(A7,PartSpecs!A:Z,2,FALSE)","v":"Misumi"},{"$f":"VLOOKUP(A7,PartSpecs!A:Z,3,FALSE)","v":"HFS5-2020-300"},{"$f":"VLOOKUP(A7,PartSpecs!A:Z,4,FALSE)","v":"HFS5-2020-300"},{"$f":"VLOOKUP(A7,PartSpecs!A:Z,5,FALSE)","v":"Site is designed for commerical customers, but you can still setup an account.  You must manually enter the part numbers into a purchase order."},{"$f":"VLOOKUP(A7,PartSpecs!A:Z,6,FALSE)","v":"[http://us.misumi-ec.com/]"}]
["2020-371mm",7,{"$f":"VLOOKUP(A8,PartSpecs!A:Z,2,FALSE)","v":"Misumi"},{"$f":"VLOOKUP(A8,PartSpecs!A:Z,3,FALSE)","v":"HFS5-2020-371"},{"$f":"VLOOKUP(A8,PartSpecs!A:Z,4,FALSE)","v":"HFS5-2020-371"},{"$f":"VLOOKUP(A8,PartSpecs!A:Z,5,FALSE)","v":"Site is designed for commerical customers, but you can still setup an account.  You must manually enter the part numbers into a purchase order."},{"$f":"VLOOKUP(A8,PartSpecs!A:Z,6,FALSE)","v":"[http://us.misumi-ec.com/]"}]
["2020-50mm",2,{"$f":"VLOOKUP(A9,PartSpecs!A:Z,2,FALSE)","v":"Misumi"},{"$f":"VLOOKUP(A9,PartSpecs!A:Z,3,FALSE)","v":"HFS5-2020-50"},{"$f":"VLOOKUP(A9,PartSpecs!A:Z,4,FALSE)","v":"HFS5-2020-50"},{"$f":"VLOOKUP(A9,PartSpecs!A:Z,5,FALSE)","v":"Site is designed for commerical customers, but you can still setup an account.  You must manually enter the part numbers into a purchase order."},{"$f":"VLOOKUP(A9,PartSpecs!A:Z,6,FALSE)","v":"[http://us.misumi-ec.com/]"}]
["2020-800mm",3,{"$f":"VLOOKUP(A10,PartSpecs!A:Z,2,FALSE)","v":"Misumi"},{"$f":"VLOOKUP(A10,PartSpecs!A:Z,3,FALSE)","v":"HFS5-2020-800"},{"$f":"VLOOKUP(A10,PartSpecs!A:Z,4,FALSE)","v":"HFS5-2020-800"},{"$f":"VLOOKUP(A10,PartSpecs!A:Z,5,FALSE)","v":"Site is designed for commerical customers, but you can still setup an account.  You must manually enter the part numbers into a purchase order."},{"$f":"VLOOKUP(A10,PartSpecs!A:Z,6,FALSE)","v":"[http://us.misumi-ec.com/]"}]
["bearing_608z",4,{"$f":"VLOOKUP(A11,PartSpecs!A:Z,2,FALSE)","v":"Amazon"},{"$f":"VLOOKUP(A11,PartSpecs!A:Z,3,FALSE)","v":"608z"},{"$f":"VLOOKUP(A11,PartSpecs!A:Z,4,FALSE)","v":" "},{"$f":"VLOOKUP(A11,PartSpecs!A:Z,5,FALSE)","v":"Easily sourced"},{"$f":"VLOOKUP(A11,PartSpecs!A:Z,6,FALSE)","v":"[http://www.amazon.com/Amico-Single-Shielded-Miniature-Bearings/dp/B00843OUNI/ref=sr_1_1?ie=UTF8&qid=1391903370&sr=8-1&keywords=608z]"}]
["bearing_624z",6,{"$f":"VLOOKUP(A12,PartSpecs!A:Z,2,FALSE)","v":"Amazon"},{"$f":"VLOOKUP(A12,PartSpecs!A:Z,3,FALSE)","v":"624z"},{"$f":"VLOOKUP(A12,PartSpecs!A:Z,4,FALSE)","v":" "},{"$f":"VLOOKUP(A12,PartSpecs!A:Z,5,FALSE)","v":"Easily sourced"},{"$f":"VLOOKUP(A12,PartSpecs!A:Z,6,FALSE)","v":"[http://www.amazon.com/Amico-Single-Shielded-Groove-Bearing/dp/B00AUB7M3C/ref=sr_1_1?ie=UTF8&qid=1391903417&sr=8-1&keywords=624z]"}]
["bed_glass",1,{"$f":"VLOOKUP(A13,PartSpecs!A:Z,2,FALSE)","v":"(no vendor data entered)"},{"$f":"VLOOKUP(A13,PartSpecs!A:Z,3,FALSE)","v":" "},{"$f":"VLOOKUP(A13,PartSpecs!A:Z,4,FALSE)","v":" "},{"$f":"VLOOKUP(A13,PartSpecs!A:Z,5,FALSE)","v":"300mm beds appear to be scare at the moment.  Looking into sources.  250mm from TrinityLabs may need to be an interim substitue."},{"$f":"VLOOKUP(A13,PartSpecs!A:Z,6,FALSE)","v":""}]
["belt_gt2_1700mm",3,{"$f":"VLOOKUP(A14,PartSpecs!A:Z,2,FALSE)","v":"OpenBuilds"},{"$f":"VLOOKUP(A14,PartSpecs!A:Z,3,FALSE)","v":" "},{"$f":"VLOOKUP(A14,PartSpecs!A:Z,4,FALSE)","v":" "},{"$f":"VLOOKUP(A14,PartSpecs!A:Z,5,FALSE)","v":"Order by the foot. 304.8 mm / ft!"},{"$f":"VLOOKUP(A14,PartSpecs!A:Z,6,FALSE)","v":"[http://openbuildspartstore.com/gt2-2mm-timing-belt/]"}]
["bracket_heater_sppt_wood",1,{"$f":"VLOOKUP(A15,PartSpecs!A:Z,2,FALSE)","v":"Ponoko"},{"$f":"VLOOKUP(A15,PartSpecs!A:Z,3,FALSE)","v":" "},{"$f":"VLOOKUP(A15,PartSpecs!A:Z,4,FALSE)","v":" "},{"$f":"VLOOKUP(A15,PartSpecs!A:Z,5,FALSE)","v":"Wooden piece.  Laser cutting files on GitHub & ponoko"},{"$f":"VLOOKUP(A15,PartSpecs!A:Z,6,FALSE)","v":"[http://www.ponoko.com/design-your-own/products/cossel-wood-plate-11227]"}]
["bracket_hot_end_groovemount_dual",1,{"$f":"VLOOKUP(A16,PartSpecs!A:Z,2,FALSE)","v":"Ponoko"},{"$f":"VLOOKUP(A16,PartSpecs!A:Z,3,FALSE)","v":" "},{"$f":"VLOOKUP(A16,PartSpecs!A:Z,4,FALSE)","v":" "},{"$f":"VLOOKUP(A16,PartSpecs!A:Z,5,FALSE)","v":"Wooden piece.  Laser cutting files on GitHub & ponoko"},{"$f":"VLOOKUP(A16,PartSpecs!A:Z,6,FALSE)","v":"[http://www.ponoko.com/design-your-own/products/cossel-wood-plate-11227]"}]
["bracket_power_supply_stablity_xy",1,{"$f":"VLOOKUP(A17,PartSpecs!A:Z,2,FALSE)","v":"Ponoko"},{"$f":"VLOOKUP(A17,PartSpecs!A:Z,3,FALSE)","v":" "},{"$f":"VLOOKUP(A17,PartSpecs!A:Z,4,FALSE)","v":" "},{"$f":"VLOOKUP(A17,PartSpecs!A:Z,5,FALSE)","v":"Wooden piece.  Laser cutting files on GitHub & ponoko"},{"$f":"VLOOKUP(A17,PartSpecs!A:Z,6,FALSE)","v":"[http://www.ponoko.com/design-your-own/products/cossel-wood-plate-11227]"}]
["bracket_tee_2020",9,{"$f":"VLOOKUP(A18,PartSpecs!A:Z,2,FALSE)","v":"Misumui"},{"$f":"VLOOKUP(A18,PartSpecs!A:Z,3,FALSE)","v":"HBLFSN5"},{"$f":"VLOOKUP(A18,PartSpecs!A:Z,4,FALSE)","v":"HBLFSN5"},{"$f":"VLOOKUP(A18,PartSpecs!A:Z,5,FALSE)","v":"Site is designed for commerical customers, but you can still setup an account.  You must manually enter the part numbers into a purchase order."},{"$f":"VLOOKUP(A18,PartSpecs!A:Z,6,FALSE)","v":"[http://us.misumi-ec.com/]"}]
["cable_ribbon_10_conductor_15ft",2,{"$f":"VLOOKUP(A19,PartSpecs!A:Z,2,FALSE)","v":"SparkFun"},{"$f":"VLOOKUP(A19,PartSpecs!A:Z,3,FALSE)","v":" "},{"$f":"VLOOKUP(A19,PartSpecs!A:Z,4,FALSE)","v":"CAB-1064"},{"$f":"VLOOKUP(A19,PartSpecs!A:Z,5,FALSE)","v":"Used for bulk-running the opto +V, SIG, & GND to the board.  Also used for clean motor runs and I/O to the EE.  Note, some have suggested this is too thin of wire gauge.  User to decide"},{"$f":"VLOOKUP(A19,PartSpecs!A:Z,6,FALSE)","v":"[https://www.sparkfun.com/products/10647]"}]
["drive_filament_dia",2,{"$f":"VLOOKUP(A20,PartSpecs!A:Z,2,FALSE)","v":"RepRap Sources"},{"$f":"VLOOKUP(A20,PartSpecs!A:Z,3,FALSE)","v":" "},{"$f":"VLOOKUP(A20,PartSpecs!A:Z,4,FALSE)","v":" "},{"$f":"VLOOKUP(A20,PartSpecs!A:Z,5,FALSE)","v":"Mk7-like with 8mm bore to be compatible with phidgets geared steppers."},{"$f":"VLOOKUP(A20,PartSpecs!A:Z,6,FALSE)","v":"[http://reprap.org/wiki/Drive-gear]"}]
["epoxy_two_part",1,{"$f":"VLOOKUP(A21,PartSpecs!A:Z,2,FALSE)","v":"Amazon"},{"$f":"VLOOKUP(A21,PartSpecs!A:Z,3,FALSE)","v":" "},{"$f":"VLOOKUP(A21,PartSpecs!A:Z,4,FALSE)","v":" "},{"$f":"VLOOKUP(A21,PartSpecs!A:Z,5,FALSE)","v":"For gluing the rod ends to the carbon tubing"},{"$f":"VLOOKUP(A21,PartSpecs!A:Z,6,FALSE)","v":"[http://www.amazon.com/Devcon-2-Ton-Crystal-Clear-0-84-Ounce/dp/B0006O8QQ0/ref=sr_1_1?s=toys-and-games&ie=UTF8&qid=1391907029&sr=1-1&keywords=two+part+epoxy]"}]
["extruder_maker_gear",2,{"$f":"VLOOKUP(A22,PartSpecs!A:Z,2,FALSE)","v":"MakerGear"},{"$f":"VLOOKUP(A22,PartSpecs!A:Z,3,FALSE)","v":" "},{"$f":"VLOOKUP(A22,PartSpecs!A:Z,4,FALSE)","v":" "},{"$f":"VLOOKUP(A22,PartSpecs!A:Z,5,FALSE)","v":"Make sure to configure your order for 1.75 barrel."},{"$f":"VLOOKUP(A22,PartSpecs!A:Z,6,FALSE)","v":"[http://www.makergear.com/products/extruders]"}]
["fan_40mm_12VDC",2,{"$f":"VLOOKUP(A23,PartSpecs!A:Z,2,FALSE)","v":"Amazon"},{"$f":"VLOOKUP(A23,PartSpecs!A:Z,3,FALSE)","v":" "},{"$f":"VLOOKUP(A23,PartSpecs!A:Z,4,FALSE)","v":" "},{"$f":"VLOOKUP(A23,PartSpecs!A:Z,5,FALSE)","v":"Most 40mm 12VDC fans should do the trick"},{"$f":"VLOOKUP(A23,PartSpecs!A:Z,6,FALSE)","v":"[http://www.amazon.com/Gelid-Solutions-Silent-40mm-FN-SX04-42/dp/B00BF3S83C/ref=sr_1_6?s=electronics&ie=UTF8&qid=1391904001&sr=1-6&keywords=40mm+fan]"}]
["fitting_one_touch_4mm",4,{"$f":"VLOOKUP(A24,PartSpecs!A:Z,2,FALSE)","v":"Amazon"},{"$f":"VLOOKUP(A24,PartSpecs!A:Z,3,FALSE)","v":"KQ2S04-M5A"},{"$f":"VLOOKUP(A24,PartSpecs!A:Z,4,FALSE)","v":" "},{"$f":"VLOOKUP(A24,PartSpecs!A:Z,5,FALSE)","v":"5mm thread req'd and 4mm OD tube receptable req'd"},{"$f":"VLOOKUP(A24,PartSpecs!A:Z,6,FALSE)","v":"[http://www.amazon.com/dp/B00AM42V6U/ref=biss_dp_sa1]"}]
["gear_drive_belt_gt2",3,{"$f":"VLOOKUP(A25,PartSpecs!A:Z,2,FALSE)","v":"OpenBuilds"},{"$f":"VLOOKUP(A25,PartSpecs!A:Z,3,FALSE)","v":" "},{"$f":"VLOOKUP(A25,PartSpecs!A:Z,4,FALSE)","v":" "},{"$f":"VLOOKUP(A25,PartSpecs!A:Z,5,FALSE)","v":"20 tooth or less is critical to prevent the belt from hitting the carriage"},{"$f":"VLOOKUP(A25,PartSpecs!A:Z,6,FALSE)","v":"[http://openbuildspartstore.com/gt2-2mm-aluminum-timing-pulley-20/]"}]
["motor_nema_17",3,{"$f":"VLOOKUP(A26,PartSpecs!A:Z,2,FALSE)","v":"Ultimachine"},{"$f":"VLOOKUP(A26,PartSpecs!A:Z,3,FALSE)","v":" "},{"$f":"VLOOKUP(A26,PartSpecs!A:Z,4,FALSE)","v":"UMN17MTR"},{"$f":"VLOOKUP(A26,PartSpecs!A:Z,5,FALSE)","v":"Std reprap motor"},{"$f":"VLOOKUP(A26,PartSpecs!A:Z,6,FALSE)","v":"[https://ultimachine.com/content/kysan-1124090-nema-17-stepper-motor]"}]
["motor_nema_17_geared_5.18_1",2,{"$f":"VLOOKUP(A27,PartSpecs!A:Z,2,FALSE)","v":"Phidgets"},{"$f":"VLOOKUP(A27,PartSpecs!A:Z,3,FALSE)","v":" "},{"$f":"VLOOKUP(A27,PartSpecs!A:Z,4,FALSE)","v":"3317_1"},{"$f":"VLOOKUP(A27,PartSpecs!A:Z,5,FALSE)","v":"Extra torque required for long bowden path to hot end"},{"$f":"VLOOKUP(A27,PartSpecs!A:Z,6,FALSE)","v":"[http://www.phidgets.com/products.php?product_id=3317]"}]
["nut_extr_m4",79,{"$f":"VLOOKUP(A28,PartSpecs!A:Z,2,FALSE)","v":"Misumi"},{"$f":"VLOOKUP(A28,PartSpecs!A:Z,3,FALSE)","v":"HNTTBS5-4"},{"$f":"VLOOKUP(A28,PartSpecs!A:Z,4,FALSE)","v":"HNTTBS5-4"},{"$f":"VLOOKUP(A28,PartSpecs!A:Z,5,FALSE)","v":"Site is designed for commerical customers, but you can still setup an account.  You must manually enter the part numbers into a purchase order."},{"$f":"VLOOKUP(A28,PartSpecs!A:Z,6,FALSE)","v":""}]
["nut_extr_m5 (open_rail_kit_excess)",69,{"$f":"VLOOKUP(A29,PartSpecs!A:Z,2,FALSE)","v":"OpenBuilds"},{"$f":"VLOOKUP(A29,PartSpecs!A:Z,3,FALSE)","v":" "},{"$f":"VLOOKUP(A29,PartSpecs!A:Z,4,FALSE)","v":" "},{"$f":"VLOOKUP(A29,PartSpecs!A:Z,5,FALSE)","v":"Do not order directly for hardware.  You will have excess from your wheel kits which instead use the eccentric spacer."},{"$f":"VLOOKUP(A29,PartSpecs!A:Z,6,FALSE)","v":""}]
["nut_m3",35,{"$f":"VLOOKUP(A30,PartSpecs!A:Z,2,FALSE)","v":"Fastenal"},{"$f":"VLOOKUP(A30,PartSpecs!A:Z,3,FALSE)","v":" "},{"$f":"VLOOKUP(A30,PartSpecs!A:Z,4,FALSE)","v":" "},{"$f":"VLOOKUP(A30,PartSpecs!A:Z,5,FALSE)","v":"Nylon lock preferred"},{"$f":"VLOOKUP(A30,PartSpecs!A:Z,6,FALSE)","v":"[http://www.fastenal.com/web/products/details/1L2510000A20000?searchMode=productSearch&zipcode=&filterByStore=&filterByVendingMachine=]"}]
{"$rows_left_out":72}
{"sheet":"PartSpecs","index":2,"n_rows":100,"n_cols":7,"rows_kept":100,"cut":false,"hidden":false,"merged":[]}
["Part","Vendor","MFG PN","Vendor PN","Notes","WikiLink","Link"]
["2020_cap","Misumi","HFC5-2020","HFC5-2020","Site is designed for commerical customers, but you can still setup an account.  You must manually enter the part numbers into a purchase order.",{"$f":"IF( ISBLANK(G2),\n     \"\",\n     \"[\"&G2&\"]\"\n)","v":"[http://us.misumi-ec.com/]"},"http://us.misumi-ec.com/"]
["2020-134mm","Misumi","HFS5-2020-134","HFS5-2020-134","Site is designed for commerical customers, but you can still setup an account.  You must manually enter the part numbers into a purchase order.","[http://us.misumi-ec.com/]","http://us.misumi-ec.com/"]
["2020-200mm","Misumi","HFS5-2020-200","HFS5-2020-200","Site is designed for commerical customers, but you can still setup an account.  You must manually enter the part numbers into a purchase order.","[http://us.misumi-ec.com/]","http://us.misumi-ec.com/"]
["2020-300mm","Misumi","HFS5-2020-300","HFS5-2020-300","Site is designed for commerical customers, but you can still setup an account.  You must manually enter the part numbers into a purchase order.","[http://us.misumi-ec.com/]","http://us.misumi-ec.com/"]
["2020-371mm","Misumi","HFS5-2020-371","HFS5-2020-371","Site is designed for commerical customers, but you can still setup an account.  You must manually enter the part numbers into a purchase order.","[http://us.misumi-ec.com/]","http://us.misumi-ec.com/"]
["2020-50mm","Misumi","HFS5-2020-50","HFS5-2020-50","Site is designed for commerical customers, but you can still setup an account.  You must manually enter the part numbers into a purchase order.","[http://us.misumi-ec.com/]","http://us.misumi-ec.com/"]
["2020-800mm","Misumi","HFS5-2020-800","HFS5-2020-800","Site is designed for commerical customers, but you can still setup an account.  You must manually enter the part numbers into a purchase order.","[http://us.misumi-ec.com/]","http://us.misumi-ec.com/"]
["bearing_608z","Amazon","608z"," ","Easily sourced","[http://www.amazon.com/Amico-Single-Shielded-Miniature-Bearings/dp/B00843OUNI/ref=sr_1_1?ie=UTF8&qid=1391903370&sr=8-1&keywords=608z]","http://www.amazon.com/Amico-Single-Shielded-Miniature-Bearings/dp/B00843OUNI/ref=sr_1_1?ie=UTF8&qid=1391903370&sr=8-1&keywords=608z"]
["bearing_624z","Amazon","624z"," ","Easily sourced","[http://www.amazon.com/Amico-Single-Shielded-Groove-Bearing/dp/B00AUB7M3C/ref=sr_1_1?ie=UTF8&qid=1391903417&sr=8-1&keywords=624z]","http://www.amazon.com/Amico-Single-Shielded-Groove-Bearing/dp/B00AUB7M3C/ref=sr_1_1?ie=UTF8&qid=1391903417&sr=8-1&keywords=624z"]
["bed_glass","(no vendor data entered)"," "," ","300mm beds appear to be scare at the moment.  Looking into sources.  250mm from TrinityLabs may need to be an interim substitue.",""]
["belt_gt2_1700mm","OpenBuilds"," "," ","Order by the foot. 304.8 mm / ft!","[http://openbuildspartstore.com/gt2-2mm-timing-belt/]","http://openbuildspartstore.com/gt2-2mm-timing-belt/"]
["bracket_heater_sppt_wood","Ponoko"," "," ","Wooden piece.  Laser cutting files on GitHub & ponoko","[http://www.ponoko.com/design-your-own/products/cossel-wood-plate-11227]","http://www.ponoko.com/design-your-own/products/cossel-wood-plate-11227"]
["bracket_hot_end_groovemount_dual","Ponoko"," "," ","Wooden piece.  Laser cutting files on GitHub & ponoko","[http://www.ponoko.com/design-your-own/products/cossel-wood-plate-11227]","http://www.ponoko.com/design-your-own/products/cossel-wood-plate-11227"]
["bracket_power_supply","RP","RP","RP","Files on GitHub",""]
["bracket_power_supply_stablity_xy","Ponoko"," "," ","Wooden piece.  Laser cutting files on GitHub & ponoko","[http://www.ponoko.com/design-your-own/products/cossel-wood-plate-11227]","http://www.ponoko.com/design-your-own/products/cossel-wood-plate-11227"]
["bracket_tee_2020","Misumui","HBLFSN5","HBLFSN5","Site is designed for commerical customers, but you can still setup an account.  You must manually enter the part numbers into a purchase order.","[http://us.misumi-ec.com/]","http://us.misumi-ec.com/"]
["cable_ribbon_10_conductor_15ft","SparkFun"," ","CAB-1064","Used for bulk-running the opto +V, SIG, & GND to the board.  Also used for clean motor runs and I/O to the EE.  Note, some have suggested this is too thin of wire gauge.  User to decide","[https://www.sparkfun.com/products/10647]","https://www.sparkfun.com/products/10647"]
["drive_filament_dia","RepRap Sources"," "," ","Mk7-like with 8mm bore to be compatible with phidgets geared steppers.","[http://reprap.org/wiki/Drive-gear]","http://reprap.org/wiki/Drive-gear"]
["epoxy_two_part","Amazon"," "," ","For gluing the rod ends to the carbon tubing","[http://www.amazon.com/Devcon-2-Ton-Crystal-Clear-0-84-Ounce/dp/B0006O8QQ0/ref=sr_1_1?s=toys-and-games&ie=UTF8&qid=1391907029&sr=1-1&keywords=two+part+epoxy]","http://www.amazon.com/Devcon-2-Ton-Crystal-Clear-0-84-Ounce/dp/B0006O8QQ0/ref=sr_1_1?s=toys-and-games&ie=UTF8&qid=1391907029&sr=1-1&keywords=two+part+epoxy"]
["extruder_maker_gear","MakerGear"," "," ","Make sure to configure your order for 1.75 barrel.","[http://www.makergear.com/products/extruders]","http://www.makergear.com/products/extruders"]
["fan_40mm_12VDC","Amazon"," "," ","Most 40mm 12VDC fans should do the trick","[http://www.amazon.com/Gelid-Solutions-Silent-40mm-FN-SX04-42/dp/B00BF3S83C/ref=sr_1_6?s=electronics&ie=UTF8&qid=1391904001&sr=1-6&keywords=40mm+fan]","http://www.amazon.com/Gelid-Solutions-Silent-40mm-FN-SX04-42/dp/B00BF3S83C/ref=sr_1_6?s=electronics&ie=UTF8&qid=1391904001&sr=1-6&keywords=40mm+fan"]
["fitting_one_touch_4mm","Amazon","KQ2S04-M5A"," ","5mm thread req'd and 4mm OD tube receptable req'd","[http://www.amazon.com/dp/B00AM42V6U/ref=biss_dp_sa1]","http://www.amazon.com/dp/B00AM42V6U/ref=biss_dp_sa1"]
["gear_drive_belt_gt2","OpenBuilds"," "," ","20 tooth or less is critical to prevent the belt from hitting the carriage","[http://openbuildspartstore.com/gt2-2mm-aluminum-timing-pulley-20/]","http://openbuildspartstore.com/gt2-2mm-aluminum-timing-pulley-20/"]
["motor_nema_17","Ultimachine"," ","UMN17MTR","Std reprap motor","[https://ultimachine.com/content/kysan-1124090-nema-17-stepper-motor]","https://ultimachine.com/content/kysan-1124090-nema-17-stepper-motor"]
["motor_nema_17_geared_5.18_1","Phidgets"," ","3317_1","Extra torque required for long bowden path to hot end","[http://www.phidgets.com/products.php?product_id=3317]","http://www.phidgets.com/products.php?product_id=3317"]
["nut_extr_m4","Misumi","HNTTBS5-4","HNTTBS5-4","Site is designed for commerical customers, but you can still setup an account.  You must manually enter the part numbers into a purchase order.",""]
["nut_extr_m5 (open_rail_kit_excess)","OpenBuilds"," "," ","Do not order directly for hardware.  You will have excess from your wheel kits which instead use the eccentric spacer.",""]
["nut_m3","Fastenal"," "," ","Nylon lock preferred","[http://www.fastenal.com/web/products/details/1L2510000A20000?searchMode=productSearch&zipcode=&filterByStore=&filterByVendingMachine=]","http://www.fastenal.com/web/products/details/1L2510000A20000?searchMode=productSearch&zipcode=&filterByStore=&filterByVendingMachine="]
["nut_m3_jam","Fastenal"," "," ","Jam","[http://www.fastenal.com/web/products/details/MJ2510000A20000?searchMode=productSearch&zipcode=&filterByStore=&filterByVendingMachine=]","http://www.fastenal.com/web/products/details/MJ2510000A20000?searchMode=productSearch&zipcode=&filterByStore=&filterByVendingMachine="]
{"$rows_left_out":70}